{"text_format":"1","workbook":"xlsx","n_sheets":4,"sheets":["Order Form","Item Lookup","Upload Form","lists"],"not_rendered":{"charts":0,"images":3,"macros":1,"external_links":0,"defined_names":8,"comments":0,"pivot_tables":0},"unopened":[],"bounds":{"document_bytes":16777216,"sheet_cells":100000,"rows_first":2000,"rows_last":500,"rows_between":2000,"halvings":0,"cell_chars":16384,"cell_head_chars":4096},"cells_cut":0,"cells_raw":0,"read":"whole","date_system":"1900"}

{"sheet":"Order Form","index":0,"n_rows":288,"n_cols":8,"rows_kept":288,"cut":false,"hidden":false,"merged":[[2,1,2,2],[3,1,3,2],[5,1,5,2],[6,1,6,2],[0,0,0,6],[1,1,1,2],[4,1,4,2]]}
["CNC Sample Form - Q4 2024"]
["Company Name:",null,null,null,null,null,"CNC Associates Inc."]
["Customer PO#:",null,null,null,null,null,"101 Kentile Road"]
["Ship Address:",null,null,null,null,null,"S. Plainfield, NJ 07080"]
["Ship ZIP",null,null,null,null,null,"Tel 718.416.3853"]
["Delivery Contact",null,null,null,null,null," Fax 718.416.4077"]
["Requested Ship Date"]
["Multiplier:",null,null,null,null,"TOTAL:",{"$f":"SUM(G11:G288)","v":0}]
[null,null,null,null,null,"CUBIC FEET:",{"$f":"ROUNDUP(SUM(H11:H288),0)","v":0}]
["Style","Prefix","Size - Description","Qty","Tag","Unit Price","Cost","Column1"]
[null,{"$f":"IF(ISNA(VLOOKUP(A11,tblStyle[],3,0)),\"\",VLOOKUP(A11,tblStyle[],3,0))","v":""},null,null,null,{"$f":"_xlfn.IFNA(_xlfn.XLOOKUP(tblOrder[[#This Row],[Size - Description]],tblItemHidden[ITEM CODE DESC],tblItemHidden[UNIT PRICE],,0,1),\"\")","v":""},{"$f":"IFERROR(tblOrder[[#This Row],[Qty]]*tblOrder[[#This Row],[Unit Price]],\"\")","v":""},{"$f":"IFERROR(INDEX(tblItemHidden[], MATCH(B11&\"-\"&LEFT(C11,FIND(\" - \",C11,1)-1), ItemCodeLookup, 0), 10) * $D11,\"\")","v":""}]
[null,{"$f":"IF(ISNA(VLOOKUP(A12,tblStyle[],3,0)),\"\",VLOOKUP(A12,tblStyle[],3,0))","v":""},null,null,null,{"$f":"_xlfn.IFNA(_xlfn.XLOOKUP(tblOrder[[#This Row],[Size - Description]],tblItemHidden[ITEM CODE DESC],tblItemHidden[UNIT PRICE],,0,1),\"\")","v":""},{"$f":"IFERROR(tblOrder[[#This Row],[Qty]]*tblOrder[[#This Row],[Unit Price]],\"\")","v":""},{"$f":"IFERROR(INDEX(tblItemHidden[], MATCH(B12&\"-\"&LEFT(C12,FIND(\" - \",C12,1)-1), ItemCodeLookup, 0), 10) * $D12,\"\")","v":""}]
[null,{"$f":"IF(ISNA(VLOOKUP(A13,tblStyle[],3,0)),\"\",VLOOKUP(A13,tblStyle[],3,0))","v":""},null,null,null,{"$f":"_xlfn.IFNA(_xlfn.XLOOKUP(tblOrder[[#This Row],[Size - Description]],tblItemHidden[ITEM CODE DESC],tblItemHidden[UNIT PRICE],,0,1),\"\")","v":""},{"$f":"IFERROR(tblOrder[[#This Row],[Qty]]*tblOrder[[#This Row],[Unit Price]],\"\")","v":""},{"$f":"IFERROR(INDEX(tblItemHidden[], MATCH(B13&\"-\"&LEFT(C13,FIND(\" - \",C13,1)-1), ItemCodeLookup, 0), 10) * $D13,\"\")","v":""}]
[null,{"$f":"IF(ISNA(VLOOKUP(A14,tblStyle[],3,0)),\"\",VLOOKUP(A14,tblStyle[],3,0))","v":""},null,null,null,{"$f":"_xlfn.IFNA(_xlfn.XLOOKUP(tblOrder[[#This Row],[Size - Description]],tblItemHidden[ITEM CODE DESC],tblItemHidden[UNIT PRICE],,0,1),\"\")","v":""},{"$f":"IFERROR(tblOrder[[#This Row],[Qty]]*tblOrder[[#This Row],[Unit Price]],\"\")","v":""},{"$f":"IFERROR(INDEX(tblItemHidden[], MATCH(B14&\"-\"&LEFT(C14,FIND(\" - \",C14,1)-1), ItemCodeLookup, 0), 10) * $D14,\"\")","v":""}]
[null,{"$f":"IF(ISNA(VLOOKUP(A15,tblStyle[],3,0)),\"\",VLOOKUP(A15,tblStyle[],3,0))","v":""},null,null,null,{"$f":"_xlfn.IFNA(_xlfn.XLOOKUP(tblOrder[[#This Row],[Size - Description]],tblItemHidden[ITEM CODE DESC],tblItemHidden[UNIT PRICE],,0,1),\"\")","v":""},{"$f":"IFERROR(tblOrder[[#This Row],[Qty]]*tblOrder[[#This Row],[Unit Price]],\"\")","v":""},{"$f":"IFERROR(INDEX(tblItemHidden[], MATCH(B15&\"-\"&LEFT(C15,FIND(\" - \",C15,1)-1), ItemCodeLookup, 0), 10) * $D15,\"\")","v":""}]
{"$rows_left_out":274}
{"sheet":"Item Lookup","index":1,"n_rows":2098,"n_cols":8,"rows_kept":2098,"cut":false,"hidden":false,"merged":[]}
["CNC Item Lookup"]
[null,null,null,null,null,null,null,"CNC Associates Inc."]
[null,null,null,null,null,null,null,"101 Kentile Road"]
[null,null,null,null,null,null,null,"S. Plainfield, NJ 07080"]
[null,null,null,null,null,null,null,"Tel 718.416.3853"]
[null,null,null,null,null,null,null," Fax 718.416.4077"]
["Style Code","Cabinet Size","Item Code","Type","Description","Hinge","Glide","Unit Price"]
["SAMPLE","SBF13.5","C4-SBF13.5","SAMPLE DOOR","COUNTRY OAK - SAMPLE BASE FRONT",0,0,25]
["SAMPLE","SD11X14","C4-SD11X14","SAMPLE DOOR","COUNTRY OAK - SAMPLE DOOR",0,0,18]
["SAMPLE","SBF13.5","D03-SBF13.5","SAMPLE DOOR","DOVER MISTY GREY - SAMPLE BASE FRONT",0,0,21]
["SAMPLE","SD11X14","D03-SD11X14","SAMPLE DOOR","DOVER MISTY GREY - SAMPLE DOOR",0,0,18]
["SAMPLE","SBF13.5","D10-SBF13.5","SAMPLE DOOR","DOVER WHITE - SAMPLE BASE FRONT",0,0,21]
["SAMPLE","SD11X14","D10-SD11X14","SAMPLE DOOR","DOVER WHITE - SAMPLE DOOR",0,0,18]
["SAMPLE","SBF13.5","EB02-SBF13.5","SAMPLE DOOR","ELEGANT SMOKY GREY - SAMPLE BASE FRONT",0,0,25]
["SAMPLE","SD11X14","EB02-SD11X14","SAMPLE DOOR","ELEGANT SMOKY GREY - SAMPLE DOOR",0,0,18]
{"$rows_left_out":2084}
{"sheet":"Upload Form","index":2,"n_rows":347,"n_cols":11,"rows_kept":347,"cut":false,"hidden":false,"merged":[]}
["Warehouse","Customer","PO","Item","Qty","Tag","Requested Ship Date","Ship Address","Ship ZIP","Contact","Site Number"]
[{"$f":"IF(D2<>\"\",IF('Order Form'!$B$2=\"\",\"\",\"New Jersey\"),\"\")","v":""},{"$f":"IF(D2<>\"\",IF('Order Form'!$B$2=\"\",\"\",'Order Form'!$B$2),\"\")","v":""},{"$f":"IF(D2<>\"\",IF('Order Form'!$B$2=\"\",\"\",'Order Form'!$B$3),\"\")","v":""},{"$f":"IF(_xlfn.XLOOKUP(INDEX('Order Form'!$C:$C,ROW(D2)+9),lists!I:I,lists!C:C,\"\",0,1)=0,\"\",_xlfn.XLOOKUP(INDEX('Order Form'!$C:$C,ROW(D2)+9),lists!I:I,lists!C:C,\"\",0,1))","v":""},{"$f":"IF(INDEX('Order Form'!$D:$D,ROW(D2)+9)>0,INDEX('Order Form'!$D:$D,ROW(D2)+9),\"\")","v":""},{"$f":"IF(INDEX('Order Form'!$E:$E,ROW(E2)+9)>0,INDEX('Order Form'!$E:$E,ROW(E2)+9),\"\")","v":""},{"$f":"IF(D2>\"\",IF('Order Form'!$B$7<>0,'Order Form'!$B$7,\"\"),\"\")","v":""},{"$f":"IF(D2<>\"\",IF('Order Form'!$B$4=\"\",\"\",'Order Form'!$B$4),\"\")","v":""},{"$f":"IF(D2<>\"\",IF('Order Form'!$B$5=\"\",\"\",'Order Form'!$B$5),\"\")","v":""},{"$f":"IF(D2<>\"\",IF('Order Form'!$B$6=\"\",\"\",'Order Form'!$B$6),\"\")","v":""}]
[{"$f":"IF(D3<>\"\",IF('Order Form'!$B$2=\"\",\"\",\"New Jersey\"),\"\")","v":""},{"$f":"IF(D3<>\"\",IF('Order Form'!$B$2=\"\",\"\",'Order Form'!$B$2),\"\")","v":""},{"$f":"IF(D3<>\"\",IF('Order Form'!$B$2=\"\",\"\",'Order Form'!$B$3),\"\")","v":""},{"$f":"IF(_xlfn.XLOOKUP(INDEX('Order Form'!$C:$C,ROW(D3)+9),lists!I:I,lists!C:C,\"\",0,1)=0,\"\",_xlfn.XLOOKUP(INDEX('Order Form'!$C:$C,ROW(D3)+9),lists!I:I,lists!C:C,\"\",0,1))","v":""},{"$f":"IF(INDEX('Order Form'!$D:$D,ROW(D3)+9)>0,INDEX('Order Form'!$D:$D,ROW(D3)+9),\"\")","v":""},{"$f":"IF(INDEX('Order Form'!$E:$E,ROW(E3)+9)>0,INDEX('Order Form'!$E:$E,ROW(E3)+9),\"\")","v":""},{"$f":"IF(D3>\"\",IF('Order Form'!$B$7<>0,'Order Form'!$B$7,\"\"),\"\")","v":""},{"$f":"IF(D3<>\"\",IF('Order Form'!$B$4=\"\",\"\",'Order Form'!$B$4),\"\")","v":""},{"$f":"IF(D3<>\"\",IF('Order Form'!$B$5=\"\",\"\",'Order Form'!$B$5),\"\")","v":""},{"$f":"IF(D3<>\"\",IF('Order Form'!$B$6=\"\",\"\",'Order Form'!$B$6),\"\")","v":""}]
[{"$f":"IF(D4<>\"\",IF('Order Form'!$B$2=\"\",\"\",\"New Jersey\"),\"\")","v":""},{"$f":"IF(D4<>\"\",IF('Order Form'!$B$2=\"\",\"\",'Order Form'!$B$2),\"\")","v":""},{"$f":"IF(D4<>\"\",IF('Order Form'!$B$2=\"\",\"\",'Order Form'!$B$3),\"\")","v":""},{"$f":"IF(_xlfn.XLOOKUP(INDEX('Order Form'!$C:$C,ROW(D4)+9),lists!I:I,lists!C:C,\"\",0,1)=0,\"\",_xlfn.XLOOKUP(INDEX('Order Form'!$C:$C,ROW(D4)+9),lists!I:I,lists!C:C,\"\",0,1))","v":""},{"$f":"IF(INDEX('Order Form'!$D:$D,ROW(D4)+9)>0,INDEX('Order Form'!$D:$D,ROW(D4)+9),\"\")","v":""},{"$f":"IF(INDEX('Order Form'!$E:$E,ROW(E4)+9)>0,INDEX('Order Form'!$E:$E,ROW(E4)+9),\"\")","v":""},{"$f":"IF(D4>\"\",IF('Order Form'!$B$7<>0,'Order Form'!$B$7,\"\"),\"\")","v":""},{"$f":"IF(D4<>\"\",IF('Order Form'!$B$4=\"\",\"\",'Order Form'!$B$4),\"\")","v":""},{"$f":"IF(D4<>\"\",IF('Order Form'!$B$5=\"\",\"\",'Order Form'!$B$5),\"\")","v":""},{"$f":"IF(D4<>\"\",IF('Order Form'!$B$6=\"\",\"\",'Order Form'!$B$6),\"\")","v":""}]
[{"$f":"IF(D5<>\"\",IF('Order Form'!$B$2=\"\",\"\",\"New Jersey\"),\"\")","v":""},{"$f":"IF(D5<>\"\",IF('Order Form'!$B$2=\"\",\"\",'Order Form'!$B$2),\"\")","v":""},{"$f":"IF(D5<>\"\",IF('Order Form'!$B$2=\"\",\"\",'Order Form'!$B$3),\"\")","v":""},{"$f":"IF(_xlfn.XLOOKUP(INDEX('Order Form'!$C:$C,ROW(D5)+9),lists!I:I,lists!C:C,\"\",0,1)=0,\"\",_xlfn.XLOOKUP(INDEX('Order Form'!$C:$C,ROW(D5)+9),lists!I:I,lists!C:C,\"\",0,1))","v":""},{"$f":"IF(INDEX('Order Form'!$D:$D,ROW(D5)+9)>0,INDEX('Order Form'!$D:$D,ROW(D5)+9),\"\")","v":""},{"$f":"IF(INDEX('Order Form'!$E:$E,ROW(E5)+9)>0,INDEX('Order Form'!$E:$E,ROW(E5)+9),\"\")","v":""},{"$f":"IF(D5>\"\",IF('Order Form'!$B$7<>0,'Order Form'!$B$7,\"\"),\"\")","v":""},{"$f":"IF(D5<>\"\",IF('Order Form'!$B$4=\"\",\"\",'Order Form'!$B$4),\"\")","v":""},{"$f":"IF(D5<>\"\",IF('Order Form'!$B$5=\"\",\"\",'Order Form'!$B$5),\"\")","v":""},{"$f":"IF(D5<>\"\",IF('Order Form'!$B$6=\"\",\"\",'Order Form'!$B$6),\"\")","v":""}]
[{"$f":"IF(D6<>\"\",IF('Order Form'!$B$2=\"\",\"\",\"New Jersey\"),\"\")","v":""},{"$f":"IF(D6<>\"\",IF('Order Form'!$B$2=\"\",\"\",'Order Form'!$B$2),\"\")","v":""},{"$f":"IF(D6<>\"\",IF('Order Form'!$B$2=\"\",\"\",'Order Form'!$B$3),\"\")","v":""},{"$f":"IF(_xlfn.XLOOKUP(INDEX('Order Form'!$C:$C,ROW(D6)+9),lists!I:I,lists!C:C,\"\",0,1)=0,\"\",_xlfn.XLOOKUP(INDEX('Order Form'!$C:$C,ROW(D6)+9),lists!I:I,lists!C:C,\"\",0,1))","v":""},{"$f":"IF(INDEX('Order Form'!$D:$D,ROW(D6)+9)>0,INDEX('Order Form'!$D:$D,ROW(D6)+9),\"\")","v":""},{"$f":"IF(INDEX('Order Form'!$E:$E,ROW(E6)+9)>0,INDEX('Order Form'!$E:$E,ROW(E6)+9),\"\")","v":""},{"$f":"IF(D6>\"\",IF('Order Form'!$B$7<>0,'Order Form'!$B$7,\"\"),\"\")","v":""},{"$f":"IF(D6<>\"\",IF('Order Form'!$B$4=\"\",\"\",'Order Form'!$B$4),\"\")","v":""},{"$f":"IF(D6<>\"\",IF('Order Form'!$B$5=\"\",\"\",'Order Form'!$B$5),\"\")","v":""},{"$f":"IF(D6<>\"\",IF('Order Form'!$B$6=\"\",\"\",'Order Form'!$B$6),\"\")","v":""}]
[{"$f":"IF(D7<>\"\",IF('Order Form'!$B$2=\"\",\"\",\"New Jersey\"),\"\")","v":""},{"$f":"IF(D7<>\"\",IF('Order Form'!$B$2=\"\",\"\",'Order Form'!$B$2),\"\")","v":""},{"$f":"IF(D7<>\"\",IF('Order Form'!$B$2=\"\",\"\",'Order Form'!$B$3),\"\")","v":""},{"$f":"IF(_xlfn.XLOOKUP(INDEX('Order Form'!$C:$C,ROW(D7)+9),lists!I:I,lists!C:C,\"\",0,1)=0,\"\",_xlfn.XLOOKUP(INDEX('Order Form'!$C:$C,ROW(D7)+9),lists!I:I,lists!C:C,\"\",0,1))","v":""},{"$f":"IF(INDEX('Order Form'!$D:$D,ROW(D7)+9)>0,INDEX('Order Form'!$D:$D,ROW(D7)+9),\"\")","v":""},{"$f":"IF(INDEX('Order Form'!$E:$E,ROW(E7)+9)>0,INDEX('Order Form'!$E:$E,ROW(E7)+9),\"\")","v":""},{"$f":"IF(D7>\"\",IF('Order Form'!$B$7<>0,'Order Form'!$B$7,\"\"),\"\")","v":""},{"$f":"IF(D7<>\"\",IF('Order Form'!$B$4=\"\",\"\",'Order Form'!$B$4),\"\")","v":""},{"$f":"IF(D7<>\"\",IF('Order Form'!$B$5=\"\",\"\",'Order Form'!$B$5),\"\")","v":""},{"$f":"IF(D7<>\"\",IF('Order Form'!$B$6=\"\",\"\",'Order Form'!$B$6),\"\")","v":""}]
[{"$f":"IF(D8<>\"\",IF('Order Form'!$B$2=\"\",\"\",\"New Jersey\"),\"\")","v":""},{"$f":"IF(D8<>\"\",IF('Order Form'!$B$2=\"\",\"\",'Order Form'!$B$2),\"\")","v":""},{"$f":"IF(D8<>\"\",IF('Order Form'!$B$2=\"\",\"\",'Order Form'!$B$3),\"\")","v":""},{"$f":"IF(_xlfn.XLOOKUP(INDEX('Order Form'!$C:$C,ROW(D8)+9),lists!I:I,lists!C:C,\"\",0,1)=0,\"\",_xlfn.XLOOKUP(INDEX('Order Form'!$C:$C,ROW(D8)+9),lists!I:I,lists!C:C,\"\",0,1))","v":""},{"$f":"IF(INDEX('Order Form'!$D:$D,ROW(D8)+9)>0,INDEX('Order Form'!$D:$D,ROW(D8)+9),\"\")","v":""},{"$f":"IF(INDEX('Order Form'!$E:$E,ROW(E8)+9)>0,INDEX('Order Form'!$E:$E,ROW(E8)+9),\"\")","v":""},{"$f":"IF(D8>\"\",IF('Order Form'!$B$7<>0,'Order Form'!$B$7,\"\"),\"\")","v":""},{"$f":"IF(D8<>\"\",IF('Order Form'!$B$4=\"\",\"\",'Order Form'!$B$4),\"\")","v":""},{"$f":"IF(D8<>\"\",IF('Order Form'!$B$5=\"\",\"\",'Order Form'!$B$5),\"\")","v":""},{"$f":"IF(D8<>\"\",IF('Order Form'!$B$6=\"\",\"\",'Order Form'!$B$6),\"\")","v":""}]
[{"$f":"IF(D9<>\"\",IF('Order Form'!$B$2=\"\",\"\",\"New Jersey\"),\"\")","v":""},{"$f":"IF(D9<>\"\",IF('Order Form'!$B$2=\"\",\"\",'Order Form'!$B$2),\"\")","v":""},{"$f":"IF(D9<>\"\",IF('Order Form'!$B$2=\"\",\"\",'Order Form'!$B$3),\"\")","v":""},{"$f":"IF(_xlfn.XLOOKUP(INDEX('Order Form'!$C:$C,ROW(D9)+9),lists!I:I,lists!C:C,\"\",0,1)=0,\"\",_xlfn.XLOOKUP(INDEX('Order Form'!$C:$C,ROW(D9)+9),lists!I:I,lists!C:C,\"\",0,1))","v":""},{"$f":"IF(INDEX('Order Form'!$D:$D,ROW(D9)+9)>0,INDEX('Order Form'!$D:$D,ROW(D9)+9),\"\")","v":""},{"$f":"IF(INDEX('Order Form'!$E:$E,ROW(E9)+9)>0,INDEX('Order Form'!$E:$E,ROW(E9)+9),\"\")","v":""},{"$f":"IF(D9>\"\",IF('Order Form'!$B$7<>0,'Order Form'!$B$7,\"\"),\"\")","v":""},{"$f":"IF(D9<>\"\",IF('Order Form'!$B$4=\"\",\"\",'Order Form'!$B$4),\"\")","v":""},{"$f":"IF(D9<>\"\",IF('Order Form'!$B$5=\"\",\"\",'Order Form'!$B$5),\"\")","v":""},{"$f":"IF(D9<>\"\",IF('Order Form'!$B$6=\"\",\"\",'Order Form'!$B$6),\"\")","v":""}]
[{"$f":"IF(D10<>\"\",IF('Order Form'!$B$2=\"\",\"\",\"New Jersey\"),\"\")","v":""},{"$f":"IF(D10<>\"\",IF('Order Form'!$B$2=\"\",\"\",'Order Form'!$B$2),\"\")","v":""},{"$f":"IF(D10<>\"\",IF('Order Form'!$B$2=\"\",\"\",'Order Form'!$B$3),\"\")","v":""},{"$f":"IF(_xlfn.XLOOKUP(INDEX('Order Form'!$C:$C,ROW(D10)+9),lists!I:I,lists!C:C,\"\",0,1)=0,\"\",_xlfn.XLOOKUP(INDEX('Order Form'!$C:$C,ROW(D10)+9),lists!I:I,lists!C:C,\"\",0,1))","v":""},{"$f":"IF(INDEX('Order Form'!$D:$D,ROW(D10)+9)>0,INDEX('Order Form'!$D:$D,ROW(D10)+9),\"\")","v":""},{"$f":"IF(INDEX('Order Form'!$E:$E,ROW(E10)+9)>0,INDEX('Order Form'!$E:$E,ROW(E10)+9),\"\")","v":""},{"$f":"IF(D10>\"\",IF('Order Form'!$B$7<>0,'Order Form'!$B$7,\"\"),\"\")","v":""},{"$f":"IF(D10<>\"\",IF('Order Form'!$B$4=\"\",\"\",'Order Form'!$B$4),\"\")","v":""},{"$f":"IF(D10<>\"\",IF('Order Form'!$B$5=\"\",\"\",'Order Form'!$B$5),\"\")","v":""},{"$f":"IF(D10<>\"\",IF('Order Form'!$B$6=\"\",\"\",'Order Form'!$B$6),\"\")","v":""}]
[{"$f":"IF(D11<>\"\",IF('Order Form'!$B$2=\"\",\"\",\"New Jersey\"),\"\")","v":""},{"$f":"IF(D11<>\"\",IF('Order Form'!$B$2=\"\",\"\",'Order Form'!$B$2),\"\")","v":""},{"$f":"IF(D11<>\"\",IF('Order Form'!$B$2=\"\",\"\",'Order Form'!$B$3),\"\")","v":""},{"$f":"IF(_xlfn.XLOOKUP(INDEX('Order Form'!$C:$C,ROW(D11)+9),lists!I:I,lists!C:C,\"\",0,1)=0,\"\",_xlfn.XLOOKUP(INDEX('Order Form'!$C:$C,ROW(D11)+9),lists!I:I,lists!C:C,\"\",0,1))","v":""},{"$f":"IF(INDEX('Order Form'!$D:$D,ROW(D11)+9)>0,INDEX('Order Form'!$D:$D,ROW(D11)+9),\"\")","v":""},{"$f":"IF(INDEX('Order Form'!$E:$E,ROW(E11)+9)>0,INDEX('Order Form'!$E:$E,ROW(E11)+9),\"\")","v":""},{"$f":"IF(D11>\"\",IF('Order Form'!$B$7<>0,'Order Form'!$B$7,\"\"),\"\")","v":""},{"$f":"IF(D11<>\"\",IF('Order Form'!$B$4=\"\",\"\",'Order Form'!$B$4),\"\")","v":""},{"$f":"IF(D11<>\"\",IF('Order Form'!$B$5=\"\",\"\",'Order Form'!$B$5),\"\")","v":""},{"$f":"IF(D11<>\"\",IF('Order Form'!$B$6=\"\",\"\",'Order Form'!$B$6),\"\")","v":""}]
[{"$f":"IF(D12<>\"\",IF('Order Form'!$B$2=\"\",\"\",\"New Jersey\"),\"\")","v":""},{"$f":"IF(D12<>\"\",IF('Order Form'!$B$2=\"\",\"\",'Order Form'!$B$2),\"\")","v":""},{"$f":"IF(D12<>\"\",IF('Order Form'!$B$2=\"\",\"\",'Order Form'!$B$3),\"\")","v":""},{"$f":"IF(_xlfn.XLOOKUP(INDEX('Order Form'!$C:$C,ROW(D12)+9),lists!I:I,lists!C:C,\"\",0,1)=0,\"\",_xlfn.XLOOKUP(INDEX('Order Form'!$C:$C,ROW(D12)+9),lists!I:I,lists!C:C,\"\",0,1))","v":""},{"$f":"IF(INDEX('Order Form'!$D:$D,ROW(D12)+9)>0,INDEX('Order Form'!$D:$D,ROW(D12)+9),\"\")","v":""},{"$f":"IF(INDEX('Order Form'!$E:$E,ROW(E12)+9)>0,INDEX('Order Form'!$E:$E,ROW(E12)+9),\"\")","v":""},{"$f":"IF(D12>\"\",IF('Order Form'!$B$7<>0,'Order Form'!$B$7,\"\"),\"\")","v":""},{"$f":"IF(D12<>\"\",IF('Order Form'!$B$4=\"\",\"\",'Order Form'!$B$4),\"\")","v":""},{"$f":"IF(D12<>\"\",IF('Order Form'!$B$5=\"\",\"\",'Order Form'!$B$5),\"\")","v":""},{"$f":"IF(D12<>\"\",IF('Order Form'!$B$6=\"\",\"\",'Order Form'!$B$6),\"\")","v":""}]
[{"$f":"IF(D13<>\"\",IF('Order Form'!$B$2=\"\",\"\",\"New Jersey\"),\"\")","v":""},{"$f":"IF(D13<>\"\",IF('Order Form'!$B$2=\"\",\"\",'Order Form'!$B$2),\"\")","v":""},{"$f":"IF(D13<>\"\",IF('Order Form'!$B$2=\"\",\"\",'Order Form'!$B$3),\"\")","v":""},{"$f":"IF(_xlfn.XLOOKUP(INDEX('Order Form'!$C:$C,ROW(D13)+9),lists!I:I,lists!C:C,\"\",0,1)=0,\"\",_xlfn.XLOOKUP(INDEX('Order Form'!$C:$C,ROW(D13)+9),lists!I:I,lists!C:C,\"\",0,1))","v":""},{"$f":"IF(INDEX('Order Form'!$D:$D,ROW(D13)+9)>0,INDEX('Order Form'!$D:$D,ROW(D13)+9),\"\")","v":""},{"$f":"IF(INDEX('Order Form'!$E:$E,ROW(E13)+9)>0,INDEX('Order Form'!$E:$E,ROW(E13)+9),\"\")","v":""},{"$f":"IF(D13>\"\",IF('Order Form'!$B$7<>0,'Order Form'!$B$7,\"\"),\"\")","v":""},{"$f":"IF(D13<>\"\",IF('Order Form'!$B$4=\"\",\"\",'Order Form'!$B$4),\"\")","v":""},{"$f":"IF(D13<>\"\",IF('Order Form'!$B$5=\"\",\"\",'Order Form'!$B$5),\"\")","v":""},{"$f":"IF(D13<>\"\",IF('Order Form'!$B$6=\"\",\"\",'Order Form'!$B$6),\"\")","v":""}]
[{"$f":"IF(D14<>\"\",IF('Order Form'!$B$2=\"\",\"\",\"New Jersey\"),\"\")","v":""},{"$f":"IF(D14<>\"\",IF('Order Form'!$B$2=\"\",\"\",'Order Form'!$B$2),\"\")","v":""},{"$f":"IF(D14<>\"\",IF('Order Form'!$B$2=\"\",\"\",'Order Form'!$B$3),\"\")","v":""},{"$f":"IF(_xlfn.XLOOKUP(INDEX('Order Form'!$C:$C,ROW(D14)+9),lists!I:I,lists!C:C,\"\",0,1)=0,\"\",_xlfn.XLOOKUP(INDEX('Order Form'!$C:$C,ROW(D14)+9),lists!I:I,lists!C:C,\"\",0,1))","v":""},{"$f":"IF(INDEX('Order Form'!$D:$D,ROW(D14)+9)>0,INDEX('Order Form'!$D:$D,ROW(D14)+9),\"\")","v":""},{"$f":"IF(INDEX('Order Form'!$E:$E,ROW(E14)+9)>0,INDEX('Order Form'!$E:$E,ROW(E14)+9),\"\")","v":""},{"$f":"IF(D14>\"\",IF('Order Form'!$B$7<>0,'Order Form'!$B$7,\"\"),\"\")","v":""},{"$f":"IF(D14<>\"\",IF('Order Form'!$B$4=\"\",\"\",'Order Form'!$B$4),\"\")","v":""},{"$f":"IF(D14<>\"\",IF('Order Form'!$B$5=\"\",\"\",'Order Form'!$B$5),\"\")","v":""},{"$f":"IF(D14<>\"\",IF('Order Form'!$B$6=\"\",\"\",'Order Form'!$B$6),\"\")","v":""}]
[{"$f":"IF(D15<>\"\",IF('Order Form'!$B$2=\"\",\"\",\"New Jersey\"),\"\")","v":""},{"$f":"IF(D15<>\"\",IF('Order Form'!$B$2=\"\",\"\",'Order Form'!$B$2),\"\")","v":""},{"$f":"IF(D15<>\"\",IF('Order Form'!$B$2=\"\",\"\",'Order Form'!$B$3),\"\")","v":""},{"$f":"IF(_xlfn.XLOOKUP(INDEX('Order Form'!$C:$C,ROW(D15)+9),lists!I:I,lists!C:C,\"\",0,1)=0,\"\",_xlfn.XLOOKUP(INDEX('Order Form'!$C:$C,ROW(D15)+9),lists!I:I,lists!C:C,\"\",0,1))","v":""},{"$f":"IF(INDEX('Order Form'!$D:$D,ROW(D15)+9)>0,INDEX('Order Form'!$D:$D,ROW(D15)+9),\"\")","v":""},{"$f":"IF(INDEX('Order Form'!$E:$E,ROW(E15)+9)>0,INDEX('Order Form'!$E:$E,ROW(E15)+9),\"\")","v":""},{"$f":"IF(D15>\"\",IF('Order Form'!$B$7<>0,'Order Form'!$B$7,\"\"),\"\")","v":""},{"$f":"IF(D15<>\"\",IF('Order Form'!$B$4=\"\",\"\",'Order Form'!$B$4),\"\")","v":""},{"$f":"IF(D15<>\"\",IF('Order Form'!$B$5=\"\",\"\",'Order Form'!$B$5),\"\")","v":""},{"$f":"IF(D15<>\"\",IF('Order Form'!$B$6=\"\",\"\",'Order Form'!$B$6),\"\")","v":""}]
{"$rows_left_out":333}
{"sheet":"lists","index":3,"n_rows":148,"n_cols":23,"rows_kept":148,"cut":false,"hidden":true,"merged":[]}
["STYLE CODE","CABINET SIZE","ITEM CODE","ITEM TYPE","DESCRIPTION","HINGE","GLIDE","UNIT PRICE","ITEM CODE DESC","Cubic Feet",null,"STYLE NAME","STYLE SHORT NAME","STYLE CODE","series",null,null,null,null,null,null,null,"hello"]
["SAMPLE","SBF13.5","C4-SBF13.5","SAMPLE DOOR","COUNTRY OAK - SAMPLE BASE FRONT",0,0,25,{"$f":"tblItemHidden[[#This Row],[CABINET SIZE]]&\" - \"&tblItemHidden[[#This Row],[DESCRIPTION]]","v":"SBF13.5 - COUNTRY OAK - SAMPLE BASE FRONT"},0.12760416999999999,null,"SAMPLE","SAMPLE","SAMPLE"]
["SAMPLE","SD11X14","C4-SD11X14","SAMPLE DOOR","COUNTRY OAK - SAMPLE DOOR",0,0,18,{"$f":"tblItemHidden[[#This Row],[CABINET SIZE]]&\" - \"&tblItemHidden[[#This Row],[DESCRIPTION]]","v":"SD11X14 - COUNTRY OAK - SAMPLE DOOR"},6.6840280000000002E-2]
["SAMPLE","SBF13.5","D03-SBF13.5","SAMPLE DOOR","DOVER MISTY GREY - SAMPLE BASE FRONT",0,0,21,{"$f":"tblItemHidden[[#This Row],[CABINET SIZE]]&\" - \"&tblItemHidden[[#This Row],[DESCRIPTION]]","v":"SBF13.5 - DOVER MISTY GREY - SAMPLE BASE FRONT"},0.12760416999999999]
["SAMPLE","SD11X14","D03-SD11X14","SAMPLE DOOR","DOVER MISTY GREY - SAMPLE DOOR",0,0,18,{"$f":"tblItemHidden[[#This Row],[CABINET SIZE]]&\" - \"&tblItemHidden[[#This Row],[DESCRIPTION]]","v":"SD11X14 - DOVER MISTY GREY - SAMPLE DOOR"},6.6840280000000002E-2]
["SAMPLE","SBF13.5","D10-SBF13.5","SAMPLE DOOR","DOVER WHITE - SAMPLE BASE FRONT",0,0,21,{"$f":"tblItemHidden[[#This Row],[CABINET SIZE]]&\" - \"&tblItemHidden[[#This Row],[DESCRIPTION]]","v":"SBF13.5 - DOVER WHITE - SAMPLE BASE FRONT"},0.12760416999999999]
["SAMPLE","SD11X14","D10-SD11X14","SAMPLE DOOR","DOVER WHITE - SAMPLE DOOR",0,0,18,{"$f":"tblItemHidden[[#This Row],[CABINET SIZE]]&\" - \"&tblItemHidden[[#This Row],[DESCRIPTION]]","v":"SD11X14 - DOVER WHITE - SAMPLE DOOR"},6.6840280000000002E-2]
["SAMPLE","SBF13.5","EB02-SBF13.5","SAMPLE DOOR","ELEGANT SMOKY GREY - SAMPLE BASE FRONT",0,0,25,{"$f":"tblItemHidden[[#This Row],[CABINET SIZE]]&\" - \"&tblItemHidden[[#This Row],[DESCRIPTION]]","v":"SBF13.5 - ELEGANT SMOKY GREY - SAMPLE BASE FRONT"},0.12760416999999999]
["SAMPLE","SD11X14","EB02-SD11X14","SAMPLE DOOR","ELEGANT SMOKY GREY - SAMPLE DOOR",0,0,18,{"$f":"tblItemHidden[[#This Row],[CABINET SIZE]]&\" - \"&tblItemHidden[[#This Row],[DESCRIPTION]]","v":"SD11X14 - ELEGANT SMOKY GREY - SAMPLE DOOR"},6.6840280000000002E-2]
["SAMPLE","SD5X7","EB02-SD5X7","SAMPLE DOOR","ELEGANT SMOKY GREY - SAMPLE DOOR 5X7",0,0,10,{"$f":"tblItemHidden[[#This Row],[CABINET SIZE]]&\" - \"&tblItemHidden[[#This Row],[DESCRIPTION]]","v":"SD5X7 - ELEGANT SMOKY GREY - SAMPLE DOOR 5X7"},9.6498840000000002E-2]
["SAMPLE","SBF13.5","EB10-SBF13.5","SAMPLE DOOR","ELEGANT WHITE - SAMPLE BASE FRONT",0,0,25,{"$f":"tblItemHidden[[#This Row],[CABINET SIZE]]&\" - \"&tblItemHidden[[#This Row],[DESCRIPTION]]","v":"SBF13.5 - ELEGANT WHITE - SAMPLE BASE FRONT"},0.12760416999999999]
["SAMPLE","SD11X14","EB10-SD11X14","SAMPLE DOOR","ELEGANT WHITE - SAMPLE DOOR",0,0,18,{"$f":"tblItemHidden[[#This Row],[CABINET SIZE]]&\" - \"&tblItemHidden[[#This Row],[DESCRIPTION]]","v":"SD11X14 - ELEGANT WHITE - SAMPLE DOOR"},6.6840280000000002E-2]
["SAMPLE","SD5X7","EB10-SD5X7","SAMPLE DOOR","ELEGANT WHITE - SAMPLE DOOR 5X7",0,0,10,{"$f":"tblItemHidden[[#This Row],[CABINET SIZE]]&\" - \"&tblItemHidden[[#This Row],[DESCRIPTION]]","v":"SD5X7 - ELEGANT WHITE - SAMPLE DOOR 5X7"},9.6498840000000002E-2]
["SAMPLE","SBF13.5","EB22-SBF13.5","SAMPLE DOOR","ELEGANT DOVE - SAMPLE BASE FRONT",0,0,25,{"$f":"tblItemHidden[[#This Row],[CABINET SIZE]]&\" - \"&tblItemHidden[[#This Row],[DESCRIPTION]]","v":"SBF13.5 - ELEGANT DOVE - SAMPLE BASE FRONT"},0.12760416999999999]
["SAMPLE","SD11X14","EB22-SD11X14","SAMPLE DOOR","ELEGANT DOVE - SAMPLE DOOR",0,0,18,{"$f":"tblItemHidden[[#This Row],[CABINET SIZE]]&\" - \"&tblItemHidden[[#This Row],[DESCRIPTION]]","v":"SD11X14 - ELEGANT DOVE - SAMPLE DOOR"},6.6840280000000002E-2]
{"$rows_left_out":133}